{"text_format":"1","workbook":"xlsx","n_sheets":19,"sheets":["Portada","Simulador","Consumo","Rotativo","TarjetaCrédito","Sobregiro","VTU","Vivienda","Base Activos","Carta_Consumo1","Carta_Consumo2","Carta_Tarj_Rot1","Carta_Tarj_Rot2","Carta_Vivienda1","Carta_Vivienda2","BaseCarta","VariablesCarta","ZonasHipo","Hoja1"],"not_rendered":{"charts":0,"images":11,"macros":1,"external_links":2,"defined_names":42,"comments":4,"pivot_tables":0},"unopened":[],"bounds":{"document_bytes":16777216,"sheet_cells":100000,"rows_first":2000,"rows_last":500,"rows_between":2000,"halvings":0,"cell_chars":16384,"cell_head_chars":4096},"cells_cut":0,"cells_raw":0,"read":"whole","date_system":"1900"}

{"sheet":"Portada","index":0,"n_rows":0,"n_cols":0,"rows_kept":0,"cut":false,"hidden":false,"merged":[]}

{"sheet":"Simulador","index":1,"n_rows":20,"n_cols":3,"rows_kept":20,"cut":false,"hidden":false,"merged":[[9,2,9,11]]}
[]
[null,null,"Cómo funciona esta herramienta"]
[]
[]
[null,1,"Selecciona el tipo de producto"]
[]
[]
[null,2,"Se desplegará una ventana en la que debes seleccionar como red del producto la unica opcion Itaú."]
[]
[]
[null,3,"Si aplica, selecciona el producto específico al que realizarás el cálculo."]
[]
[]
[null,4,"Diligencia las variables de entrada, las cuales identificarás con este color:"]
[]
{"$rows_left_out":6}
{"sheet":"Consumo","index":2,"n_rows":132,"n_cols":12,"rows_kept":132,"cut":false,"hidden":false,"merged":[[132,1,132,7],[133,1,133,7],[4,3,5,3],[4,5,4,6],[4,1,4,2]]}
[null,"Valor Total Unificado "]
[null,"Consumo",null,null,null,null,null,null,null,null,"Datos en blanco",{"$f":"IF(OR(C7=\"\",C8=0,C9=0,C11=0,C13=\"\"),1,0)","v":0}]
[null,"Cifras en Pesos",null,"Volver ",null,null,null,null,null,null,"DIferencia",{"$f":"IF(OR(AND(L4=0,L5=0),AND(L4=1,L5=0),AND(L5=1,L4=0)),1,0)","v":1}]
[null,null,null,null,null,null,null,null,null,null,"Cálculo",1]
[null,"Detalles del Credito ",null,"Seleccione tipo de vehículo",null,"Costos ",null,null,null,null,"Validación",{"$f":"IF(AND(L6=D7,C7=L7,C8=L8,C9=L9,C10=L10,C11=L11,C12=L12,C13=L13,C14=L14),1,0)","v":0}]
[null,null,null,null,null,null,null,null,null,null,null,"Usado"]
[null,"Modalidad del Crédito","Crédito Personal","Usado",{"$f":"IF(C7='Base Activos'!J120,1,IF(C7='Base Activos'!J121,2,0))","v":0},"Total costos",{"$f":"IF(L4=0,0,SUM(G12:G17)+SUM(G8:G10))","v":9019765.9744288679},null,null,null,null,"Libranza Privada"]
[null,"Valor crédito",500000000,{"$f":"IF(OR(E7=1,E7=2),D7,\"\")","v":""},null,"Estudio de crédito",{"$f":"IF(L4=0,0,VLOOKUP(C7,'Base Activos'!C132:G144,5,0))","v":0},1,null,null,null,500000000]
[null,"Tasa mes vencido (mv)",0.05,null,null,"Seguro de vida",{"$f":"IF(L4=0,0,SUM(G24:G132))","v":9019765.9744288679},1,null,null,null,0.05]
[null,"Tasa efectivo anual\n(EA)",{"$f":"+((1+C9)^12)-1","v":0.79585632602212919},null,null,"Costo del desembolso",{"$f":"IF($L$4=0,0,IF(D13=1,'Base Activos'!$G$148,VLOOKUP($C$7,'Base Activos'!$C$132:$F$144,HLOOKUP($C$13,'Base Activos'!$D$132:$F$133,2,0),0)))","v":0},1,null,null,null,0.79585632602212919]
[null,"Plazo de Financiación (meses)",32,{"$f":"CONCATENATE(\"El plazo máximo de este producto es \",E11,\" meses.\")","v":"El plazo máximo de este producto es 60 meses."},{"$f":"VLOOKUP(C7,Listado_Gracia_Plazo,3,0)","v":60},"Comisión por aval",{"$f":"IF(L4=0,0,IF(H12=1,VLOOKUP(F11,ComisionesConsumo,2,0),0))","v":0},null,null,null,null,32]
[null,"Seguro de Vida",{"$f":"IFERROR(VLOOKUP(C7,'Base Activos'!$J$114:$O$125,6,0),\"\")","v":8.8000000000000003E-4},null,null,"Valor comisión por aval",{"$f":"IF(L4=0,0,IF(H12=1,G11*C8,0))","v":0},{"$f":"IF(C7='Base Activos'!J124,1,0)","v":0},null,null,null,9.9500000000000001E-4]
[null,"Forma del Desembolso","Mixta",{"$f":"IF(C13='Base Activos'!G125,1,0)","v":1},null,"Registro garantía ante Confecámaras",{"$f":"IF(L4=0,0,IF(H13=1,VLOOKUP(F13,ComisionesConsumo,2,0),0))","v":0},{"$f":"IF(E7=1,1,0)","v":0},null,null,null,"Abono en cuenta"]
[null,"Periodos de gracia",{"$f":"IF(E14=0,0,D14)","v":0},0,{"$f":"IFERROR(VLOOKUP(C7,Listado_Gracia_Plazo,2,0),0)","v":0},"Levantamiento prenda Confecamáras",{"$f":"IF(L4=0,0,IF(H13=1,VLOOKUP(F14,ComisionesConsumo,2,0),0))","v":0},{"$f":"IF(E7=1,1,0)","v":0},null,null,null,0]
[null,null,{"$f":"IF(E14>0,CONCATENATE(\"Según modalidad del crédito máximo \",E14,\" meses para \",E15),\"\")","v":""},null,{"$f":"IFERROR(VLOOKUP(C7,Listado_Gracia_Plazo,5,0),0)","v":0},"Avalúo convenio",{"$f":"IF(L4=0,0,IF(H15=1,VLOOKUP(F15,ComisionesConsumo,2,0),0))","v":0},{"$f":"IF(D8=\"usado\",1,0)","v":0}]
{"$rows_left_out":118}
{"sheet":"Rotativo","index":3,"n_rows":39,"n_cols":12,"rows_kept":39,"cut":false,"hidden":false,"merged":[[2,8,2,9],[5,1,5,2],[4,1,4,2],[38,1,38,2],[8,1,9,2],[35,1,35,2],[36,1,36,2],[37,1,37,2],[16,1,16,2]]}
[null,"Valor Total Unificado "]
[null,{"$f":"'Base Activos'!C23","v":"Crédito Rotativo"}]
[null,"Cifras en Pesos",null,null,null,null,null,null,"                   volver "]
[]
[null,"Producto",null,"Crédito Rotativo"]
[null,"Tipo",null,"Rotativo Educativo"]
[]
[null,"Cupo de seis (6) Salarios mínimos mensuales legales vigentes (SMMLV)"]
[null,"Tasa de interes ",null,{"$f":"VLOOKUP(D6,'Base Activos'!$C$26:$E$29,2,0)","v":0.1956}]
[null,null,null,{"$f":"(NOMINAL(D9,12))/12","v":1.4998714461245566E-2}]
[null,"Cupo",null,{"$f":"SMLV*6","v":7800000}]
[null,"Plazo diferido",null,{"$f":"VLOOKUP(D6,'Base Activos'!$C$26:$E$29,3,0)","v":12}]
[null,"Cuota de manejo mensual",null,{"$f":"HLOOKUP('Base Activos'!$D$1,'Base Activos'!$H$31:$K$35,VLOOKUP(Rotativo!D6,'Base Activos'!$H$31:$K$35,4,0),0)","v":29900}]
[null,"Meses exonerados",null,{"$f":"VLOOKUP(D6,'Base Activos'!$C$26:$F$29,4,0)","v":0}]
[]
{"$rows_left_out":25}
{"sheet":"TarjetaCrédito","index":4,"n_rows":78,"n_cols":12,"rows_kept":78,"cut":false,"hidden":false,"merged":[[2,8,2,9],[77,1,77,2],[8,1,9,3],[47,1,47,11],[49,1,50,2],[74,1,74,2],[75,1,75,2],[76,1,76,2],[40,1,40,2],[41,1,41,2],[13,1,13,11],[15,1,16,2],[42,1,42,2],[43,1,43,2]]}
[null,"Valor Total Unificado "]
[null,"Tarjeta de crédito"]
[null,"Cifras en Pesos",null,null,null,null,null,null,"                   volver "]
[]
[null,"Producto",null,"Tarjeta de crédito"]
[null,"Tipo de tarjeta de crédito"]
[null,"Cupo estimado cliente"]
[]
[null,{"$f":"IF(E9=1,CONCATENATE(\"VTUA según cupo: \"&B13),CONCATENATE(\"VTUA según categoría: \"&B47))","v":{"$error":"#N/A"}},null,null,{"$f":"VLOOKUP(D7,RangoCupo,2,0)","v":{"$error":"#N/A"}}]
[]
[]
[]
[null,"Cupo de dos (2) Salarios mínimos mensuales legales vigentes (SMMLV)"]
[]
[]
{"$rows_left_out":64}
{"sheet":"Sobregiro","index":5,"n_rows":25,"n_cols":12,"rows_kept":25,"cut":false,"hidden":true,"merged":[[8,1,9,2],[21,1,21,2],[22,1,22,2],[23,1,23,2],[24,1,24,2]]}
[null,"Valor Total Unificado "]
[null,"Sobregiro"]
[null,"Cifras en Pesos"]
[]
[null,"Producto",null,"Sobregiro"]
[]
[null,"Cupo de seis (2) Salarios mínimos mensuales legales vigentes (SMMLV)"]
[]
[null,"Tasa",null,{"$f":"'Base Activos'!D41","v":0.2591}]
[null,null,null,{"$f":"(NOMINAL(D9,12))/12","v":1.9385265778725458E-2}]
[null,"Cupo",null,{"$f":"SMLV*2","v":2600000}]
[null,"Plazo diferido",null,{"$f":"'Base Activos'!D42","v":1.5}]
[]
[]
[null,"Compra mes","Intereses","Abono a capital","Cuota del crédito","Cuota de Manejo","Pago Total","Pago efectivamente realizado","Nuevo Cupo Disponible","Nuevos consumos","Saldo capital","Flujos"]
{"$rows_left_out":11}
{"sheet":"VTU","index":6,"n_rows":45,"n_cols":11,"rows_kept":45,"cut":false,"hidden":false,"merged":[[12,2,14,11]]}
[]
[null,null,"Conoce el Valor Total Unificado (VTU)",null,null,null,null,null,null,null,"Volver "]
[]
[]
[null,1,"Qué es"]
[]
[null,null,"Un indicador que le permitirá a nuestros clientes: \n"]
[null,null,"Conocer la estimación de los costos e ingresos asociados a la tenencia de productos del banco durante un plazo proyectado."]
[null,null,"Comparar de forma más estandarizada la oferta de las instituciones financieras."]
[]
[null,2,"Cuál es la norma que lo soporta"]
[]
[null,null,"A partir del Decreto 1854 de 2015, que modifica el Decreto 2555 de 2010, basado en el principio de transparencia e información cierta, suficiente y oportuna por parte de las entidades vigiladas por la Superintendencia Financiera de Colombia."]
[]
[]
{"$rows_left_out":31}
{"sheet":"Vivienda","index":7,"n_rows":270,"n_cols":20,"rows_kept":270,"cut":false,"hidden":false,"merged":[[2,5,2,6],[4,5,4,6],[3,1,3,2],[3,3,3,4],[11,5,11,6],[5,5,5,6],[6,1,6,2],[6,3,6,4],[6,5,6,6],[8,5,8,6],[9,3,9,4],[9,5,9,6],[10,1,10,2],[10,3,10,4],[22,5,22,6],[19,1,19,2],[19,3,19,4],[19,5,19,6],[20,1,20,2],[20,3,20,4],[20,5,20,6],[12,5,12,6],[13,1,13,2],[13,3,13,4],[13,5,13,6],[21,5,21,6],[24,1,24,2],[12,1,12,2],[12,3,12,4],[4,1,4,2],[4,3,4,4],[21,1,21,2],[21,3,21,4],[11,1,11,2],[11,3,11,4],[8,1,8,2],[8,3,8,4],[5,1,5,2],[5,3,5,4],[22,1,22,2],[22,3,22,4],[9,1,9,2]]}
[null,"Valor Total Unificado "]
[null,"Vivienda"]
[null,"Cifras en Pesos",null,null,null,{"$f":"VLOOKUP(D5,'Base Activos'!$C$72:$E$73,2,0)","v":{"$error":"#N/A"}},null,"volver "]
[null,"Tipo de cliente",null,{"$f":"'Base Activos'!C66","v":"Cliente externo"},null,{"$f":"IFERROR(VLOOKUP(D4,'Base Activos'!$G$72:$H$73,2,0),0)","v":1},null,null,null,null,null,1,null,null,null,null,"Adquisición de vivienda nueva o usada"]
[null,"Producto",null,"Crédito de Leasing Habitacional",null,"Línea",null,"Recolocación",null,null,null,null,null,null,null,null,"Adquisición de Vivienda CxI",null,null,"Crédito Hipotecario"]
[null,"Valor inmueble",null,0,null,"Seguro de Vida",null,{"$f":"IF(C31=\"\",\"\",'Base Activos'!J58)","v":{"$error":"#N/A"}},null,{"$f":"'Base Activos'!J55","v":0},null,null,null,null,null,null,"Cesión de contratos",null,null,"Crédito de Leasing Habitacional"]
[null,"Valor inicial del crédito",null,0,null,"Número de asegurados",null,1,null,null,null,null,null,null,null,null,"Adición por mejoras"]
[null,null,null,null,null,null,null,null,null,null,null,null,null,null,null,null,"Recolocación"]
[null,"Tasa de interés Efectivo Anual (EA)",null,0.01,null,"Seguro del Inmueble (IVA incluido)",null,{"$f":"IF(J9=1,0,IF(ValidacionCalculo=0,0,IF(D6=0,\"0\",'Base Activos'!M67/12)))","v":"0"},null,{"$f":"'Base Activos'!M55","v":0},null,null,null,null,null,null,"Leaseback"]
[null,"Tasa de interés mes vencido  (EA)",null,{"$f":"(1+D9)^(1/12)-1","v":8.295381143461622E-4},null,"Valor cuota sin seguros",null,{"$f":"IF(ValidacionCalculo=0,0,C31+D31)","v":{"$error":"#N/A"}},null,null,null,null,null,null,null,null,"Construcción de vivienda individual"]
[null,"Plazo inicial",null,1,null,null,null,null,null,null,"Crédito/ValorInmueble",{"$f":"VLOOKUP(Vivienda!$H$5,IF('Base Activos'!B67=1,Hipotecario_Plazo_Monto,IF('Base Activos'!B67=2, Leasing_Plazo_Monto,0)),2,0)*D6","v":{"$error":"#N/A"}},null,null,null,null,"Compra de cartera"]
[null,"Sistema de amortización",null,"Cuota Fija",null,"Tarifa aplicada mensual \nSeguro Inmueble (IVA incluido)",null,{"$f":"+H9","v":"0"},null,null,"Plazo",{"$f":"VLOOKUP(Vivienda!$H$5,IF('Base Activos'!B67=1,Hipotecario_Plazo_Monto,IF('Base Activos'!B67=2, Leasing_Plazo_Monto,0)),3,0)","v":{"$error":"#N/A"}},null,null,null,null,"Remodelación vivienda"]
[null,"Opción de Compra %",null,0.01,null,"Departamento",null,null,null,null,null,null,null,null,null,null,"Otros usos"]
[null,"Opción de Compra $",null,{"$f":"D13*D7","v":0},null,"Zona",null,{"$f":"+VLOOKUP(H13,ZonasHipo!$C$3:$F$1130,2,0)","v":{"$error":"#N/A"}}]
[]
{"$rows_left_out":256}
{"sheet":"Base Activos","index":8,"n_rows":157,"n_cols":32,"rows_kept":157,"cut":false,"hidden":false,"merged":[[69,6,69,7],[70,6,70,7],[130,3,130,5],[70,2,70,3],[10,2,10,4],[74,2,74,3],[34,2,34,3],[48,2,48,3],[69,2,69,3],[17,2,17,3]]}
[null,null,"Red","Itaú",{"$f":"IF(D1=\"Itaú\",1,IF(D1=\"Corpbanca\",2,0))","v":1}]
[null,null,"Salario Mínimo Legal Vigente",1300000]
[null,null,"IVA",0.19]
[null,null,null,null,null,null,null,null,null,null,null,0]
[null,null,"Tarjeta de crédito"]
[]
[null,null,"Tasa",0.2591,"ea"]
[null,null,"Plazo diferido",12]
[null,null,"Meses exonerados",6]
[]
[null,null,"Cuota de manejo"]
[null,null,null,"Trimestral","Mensual"]
[null,null,"Clásica",67500,{"$f":"+D13/3","v":22500}]
[null,null,"Oro ",82200,{"$f":"+D14/3","v":27400}]
[null,null,"Platinum",91500,{"$f":"+D15/3","v":30500}]
{"$rows_left_out":143}
{"sheet":"Carta_Consumo1","index":9,"n_rows":49,"n_cols":4,"rows_kept":49,"cut":false,"hidden":false,"merged":[[8,1,8,5],[10,1,10,5],[33,1,34,5],[48,1,51,5],[26,2,26,3]]}
[]
[null,{"$f":"TODAY()","v":"2026-06-10"}]
[]
[null,"Valor Total Unificado (VTU)"]
[]
[]
[null,"Estimado cliente,"]
[]
[null,"Itaú Corpbanca Colombia S.A. pone en práctica el principio de transparencia e información cierta, suficiente y oportuna para los consumidores financieros, y por ello le informamos el Valor Total Unificado (VTU) del producto en el que se encuentra interesado."]
[]
[null,"El VTU es un indicador que le permite conocer los ingresos y/o costos asociados a tener este producto, estimando mensualmente esos valores durante un plazo específico."]
[]
[null,"Producto",{"$f":"Consumo!C7","v":"Crédito Personal"}]
[null,"Valor crédito",{"$f":"Consumo!C8","v":500000000}]
[null,"Plazo proyección",{"$f":"Consumo!C11","v":32}]
{"$rows_left_out":35}
{"sheet":"Carta_Consumo2","index":10,"n_rows":49,"n_cols":4,"rows_kept":49,"cut":false,"hidden":false,"merged":[[48,1,51,5],[8,1,8,5],[10,1,10,5],[25,2,25,3],[30,2,30,3],[33,1,34,5]]}
[]
[null,{"$f":"TODAY()","v":"2026-06-10"}]
[]
[null,"Valor Total Unificado (VTU)"]
[]
[]
[null,"Estimado cliente,"]
[]
[null,"Itaú Corpbanca Colombia S.A. pone en práctica el principio de transparencia e información cierta, suficiente y oportuna para los consumidores financieros, y por ello le informamos el Valor Total Unificado (VTU) del producto en el que se encuentra interesado."]
[]
[null,"El VTU es un indicador que le permite conocer los ingresos y/o costos asociados a tener este producto, estimando mensualmente esos valores durante un plazo específico."]
[]
[null,"Producto",{"$f":"Consumo!C7","v":"Crédito Personal"}]
[null,"Valor crédito",{"$f":"Consumo!C8","v":500000000}]
[null,"Plazo proyección",{"$f":"Consumo!C11","v":32}]
{"$rows_left_out":35}
{"sheet":"Carta_Tarj_Rot1","index":11,"n_rows":49,"n_cols":4,"rows_kept":49,"cut":false,"hidden":false,"merged":[[33,1,34,5],[48,1,51,5],[23,2,23,3],[8,1,8,5],[10,1,10,5]]}
[]
[null,{"$f":"TODAY()","v":"2026-06-10"}]
[]
[null,"Valor Total Unificado (VTU)"]
[]
[]
[null,"Estimado cliente,"]
[]
[null,"Itaú Corpbanca Colombia S.A. pone en práctica el principio de transparencia e información cierta, suficiente y oportuna para los consumidores financieros, y por ello le informamos el Valor Total Unificado (VTU) del producto en el que se encuentra interesado."]
[]
[null,"El VTU es un indicador que le permite conocer los ingresos y/o costos asociados a tener este producto, estimando mensualmente esos valores durante un plazo específico."]
[]
[null,"Producto",{"$f":"BaseCarta!C28","v":"Tarjeta de crédito"}]
[null,"Cupo estimado",{"$f":"BaseCarta!C29","v":7800000}]
[null,"Plazo proyección",{"$f":"BaseCarta!C31","v":12}]
{"$rows_left_out":35}
{"sheet":"Carta_Tarj_Rot2","index":12,"n_rows":49,"n_cols":4,"rows_kept":49,"cut":false,"hidden":false,"merged":[[8,1,8,5],[10,1,10,5],[23,2,23,3],[33,1,34,5],[48,1,51,5]]}
[]
[null,{"$f":"TODAY()","v":"2026-06-10"}]
[]
[null,"Valor Total Unificado (VTU)"]
[]
[]
[null,"Estimado cliente,"]
[]
[null,"Itaú Corpbanca Colombia S.A. pone en práctica el principio de transparencia e información cierta, suficiente y oportuna para los consumidores financieros, y por ello le informamos el Valor Total Unificado (VTU) del producto en el que se encuentra interesado."]
[]
[null,"El VTU es un indicador que le permite conocer los ingresos y/o costos asociados a tener este producto, estimando mensualmente esos valores durante un plazo específico."]
[]
[null,"Producto",{"$f":"BaseCarta!C28","v":"Tarjeta de crédito"}]
[null,"Cupo estimado",{"$f":"BaseCarta!C29","v":7800000}]
[null,"Plazo proyección",{"$f":"BaseCarta!C31","v":12}]
{"$rows_left_out":35}
{"sheet":"Carta_Vivienda1","index":13,"n_rows":49,"n_cols":4,"rows_kept":49,"cut":false,"hidden":false,"merged":[[33,1,34,5],[48,1,51,5],[8,1,8,5],[10,1,10,5]]}
[]
[null,{"$f":"TODAY()","v":"2026-06-10"}]
[]
[null,"Valor Total Unificado (VTU)"]
[]
[]
[null,"Estimado cliente,"]
[]
[null,"Itaú Corpbanca Colombia S.A. pone en práctica el principio de transparencia e información cierta, suficiente y oportuna para los consumidores financieros, y por ello le informamos el Valor Total Unificado (VTU) del producto en el que se encuentra interesado."]
[]
[null,"El VTU es un indicador que le permite conocer los ingresos y/o costos asociados a tener este producto, estimando mensualmente esos valores durante un plazo específico."]
[]
[null,"Producto",{"$f":"Vivienda!D5","v":"Crédito de Leasing Habitacional"}]
[null,"Línea de crédito",{"$f":"Vivienda!H5","v":"Recolocación"}]
[null,"Valor crédito",{"$f":"Vivienda!D7","v":0}]
{"$rows_left_out":35}
{"sheet":"Carta_Vivienda2","index":14,"n_rows":49,"n_cols":4,"rows_kept":49,"cut":false,"hidden":false,"merged":[[8,1,8,5],[10,1,10,5],[33,1,34,5],[48,1,51,5]]}
[]
[null,{"$f":"TODAY()","v":"2026-06-10"}]
[]
[null,"Valor Total Unificado (VTU)"]
[]
[]
[null,"Estimado cliente,"]
[]
[null,"Itaú Corpbanca Colombia S.A. pone en práctica el principio de transparencia e información cierta, suficiente y oportuna para los consumidores financieros, y por ello le informamos el Valor Total Unificado (VTU) del producto en el que se encuentra interesado."]
[]
[null,"El VTU es un indicador que le permite conocer los ingresos y/o costos asociados a tener este producto, estimando mensualmente esos valores durante un plazo específico."]
[]
[null,"Producto",{"$f":"Vivienda!D5","v":"Crédito de Leasing Habitacional"}]
[null,"Línea de crédito",{"$f":"Vivienda!H5","v":"Recolocación"}]
[null,"Valor crédito",{"$f":"Vivienda!D7","v":0}]
{"$rows_left_out":35}
{"sheet":"BaseCarta","index":15,"n_rows":61,"n_cols":5,"rows_kept":61,"cut":false,"hidden":false,"merged":[[20,1,20,2],[39,1,39,2],[60,1,60,2]]}
[null,"Al modificar alguna posición en este archivo validar macros asociadas a la generación de las cartas"]
[null,"Base Carta"]
[]
[null,"Consumo"]
[]
[null,"VTU pesos"]
[]
[null,"Concepto","Valor Total","Contar variable","Filtro"]
[null,"Intereses estimados",{"$f":"Consumo!C17","v":512486703.09254909},1,{"$f":"IF(D9>0,1,0)","v":1}]
[null,"Estudio de crédito",0,1,{"$f":"IF(D10>0,1,0)","v":1}]
[null,"Seguro de vida",3971.127848406029,1,1]
[null,"Costo del desembolso",0,1,1]
[null,"Comisión por aval",5.5E-2,null,0]
[null,"Valor comisión por aval",55000,1,1]
[null,"Registro garantía ante Confecámaras",0,0,0]
{"$rows_left_out":47}
{"sheet":"VariablesCarta","index":16,"n_rows":27,"n_cols":8,"rows_kept":27,"cut":false,"hidden":false,"merged":[]}
[]
[]
[null,"Variables generales carta",1,null,null,"Generar Proforma",null,0]
[]
[null,null,"Red de oficinas"]
[null,"Lista desplegable canales de venta",{"$f":"IFERROR(VLOOKUP(C5,B8:C16,2,0),0)","v":1},{"$f":"IFERROR(VLOOKUP(C5,B8:D16,3,0),0)","v":"Acércate a nuestra oficina para conocer más y adquirir este producto."}]
[null,null,"De este número depende el cuadro de datos que se solicita"]
[null,"Red de oficinas",1,"Acércate a nuestra oficina para conocer más y adquirir este producto."]
[null,"Banca de empleados",1,"Comúnicate con nosotros para conocer más y adquirir este producto."]
[null,"Gerencia de Ahorro e Inversión",2,"Comúnicate con nosotros para conocer más y adquirir este producto."]
[null,"Gerencia Comercial de Vivienda",2,"Comúnicate con nosotros para conocer más y adquirir este producto."]
[null,"Fuerza de Venta Créditos Educativos",2,"Comúnicate con nosotros para conocer más y adquirir este producto."]
[null,"Fuerza de Venta Elite",2,"Comúnicate con nosotros para conocer más y adquirir este producto."]
[null,"Autoflex",2,"Comúnicate con nosotros para conocer más y adquirir este producto."]
[null,"Contact Center",2,"Comúnicate con nosotros para conocer más y adquirir este producto."]
{"$rows_left_out":13}
{"sheet":"ZonasHipo","index":17,"n_rows":1130,"n_cols":6,"rows_kept":1130,"cut":false,"hidden":false,"merged":[[0,0,0,5]]}
["CODIFICACION MUNICIPIOS - DANE"]
["Codigo Ciudad","Nombre Ciudad","Departamento","ZONA DE RIESGO","TASA MENSUAL","TASA ANUAL"]
[91263,"EL ENCANTO","Amazonas",2,1.2300000000000001E-4,1.4769989235052794E-3]
[91405,"LA CHORRERA","Amazonas",2,1.2300000000000001E-4,1.4769989235052794E-3]
[91407,"LA PEDRERA","Amazonas",2,1.2300000000000001E-4,1.4769989235052794E-3]
[91430,"LA VICTORIA","Amazonas",2,1.2300000000000001E-4,1.4769989235052794E-3]
[91001,"LETICIA","Amazonas",2,1.2300000000000001E-4,1.4769989235052794E-3]
[91460,"MIRITI - PARANA","Amazonas",2,1.2300000000000001E-4,1.4769989235052794E-3]
[91530,"PUERTO ALEGRIA","Amazonas",2,1.2300000000000001E-4,1.4769989235052794E-3]
[91536,"PUERTO ARICA","Amazonas",2,1.2300000000000001E-4,1.4769989235052794E-3]
[91540,"PUERTO NARIÑO","Amazonas",2,1.2300000000000001E-4,1.4769989235052794E-3]
[91669,"PUERTO SANTANDER","Amazonas",2,1.2300000000000001E-4,1.4769989235052794E-3]
[91798,"TARAPACA","Amazonas",2,1.2300000000000001E-4,1.4769989235052794E-3]
[5002,"ABEJORRAL","Antioquia",2,1.2300000000000001E-4,1.4769989235052794E-3]
[5004,"ABRIAQUI","Antioquia",2,1.2300000000000001E-4,1.4769989235052794E-3]
{"$rows_left_out":1116}
{"sheet":"Hoja1","index":18,"n_rows":15,"n_cols":2,"rows_kept":15,"cut":false,"hidden":false,"merged":[]}
[]
[null,"Hola Karen,"]
[]
[null,"Agradezco por favor tu apoyo ajustando los siguientes puntos dentro del simulador:"]
[]
[null,"En la línea de producto Adquisición de Vivienda incluir las palabras nueva o usada, es decir la línea de producto deberá quedar como Adquisición de Vivienda nueva o usada (Aplica para Hipotecario y Leasing Habitacional)."]
[]
[null,"En las siguientes sublíneas de producto Leasing Habitacional por favor incluir el cobro de estudio de crédito, el simulador lo está dejando en $0."]
[]
[null,"Adición por mejoras"]
[null,"Cesión de contratos"]
[null,"Recolocación"]
[null," Devolución de canones extraordinarios"]
[]
[null,"En la lista de sublíneas de Leasing Habitacional incluir el producto Leaseback Habitacional que para efectos del simulador tiene las mismas características de Leasing Habitacional para adquisición de Vivienda."]